Reaction Details
TargetCathepsin L2
LigandBDBM50201702
Substrate/Competitorn/a
Meas. Tech.ChEMBL_438185 (CHEMBL907578)
IC50 5166±n/a nM
Citation Epple, RUrbina, HDRusso, RLiu, HMason, DBursulaya, BTumanut, CLi, JHarris, JL Bicyclic carbamates as inhibitors of papain-like cathepsin proteases. Bioorg Med Chem Lett17:1254-9 (2007) 
 
Cathepsin L2
Name:Cathepsin L2
Type:Enzyme
Mol. Mass.:37341.06
Organism:Homo sapiens (Human)
Description:O60911
Residue:334
BDBM50201702
NameBDBM50201702
Synonyms:(1R,2S)-2-phenoxy-7-oxa-5-aza-bicyclo[3.2.1]octane-6-thione | CHEMBL390643
TypeSmall organic molecule
Emp. Form.C12H13NO2S
Mol. Mass.235.302
SMILESS=C1O[C@@H]2CN1CC[C@@H]2Oc1ccccc1