Reaction Details
TargetCathepsin B
LigandBDBM50201702
Substrate/Competitorn/a
Meas. Tech.ChEMBL_438177 (CHEMBL907570)
IC50 519±n/a nM
Citation Epple, RUrbina, HDRusso, RLiu, HMason, DBursulaya, BTumanut, CLi, JHarris, JL Bicyclic carbamates as inhibitors of papain-like cathepsin proteases. Bioorg Med Chem Lett17:1254-9 (2007) 
 
Cathepsin B
Name:Cathepsin B
Type:Enzyme
Mol. Mass.:37819.69
Organism:Homo sapiens (Human)
Description:gi_63102437
Residue:339
BDBM50201702
NameBDBM50201702
Synonyms:(1R,2S)-2-phenoxy-7-oxa-5-aza-bicyclo[3.2.1]octane-6-thione | CHEMBL390643
TypeSmall organic molecule
Emp. Form.C12H13NO2S
Mol. Mass.235.302
SMILESS=C1O[C@@H]2CN1CC[C@@H]2Oc1ccccc1