Reaction Details
Target11-beta-hydroxysteroid dehydrogenase type 2
LigandBDBM50202094
Substrate/Competitorn/a
Meas. Tech.ChEMBL_423359 (CHEMBL909906)
IC50>100000±n/a nM
Citation Rohde, JJPliushchev, MASorensen, BKWodka, DShuai, QWang, JFung, SMonzon, KMChiou, WJPan, LDeng, XChovan, LERamaiya, AMullally, MHenry, RFStolarik, DFImade, HMMarsh, KCBeno, DWFey, TADroz, BABrune, MECamp, HSSham, HLFrevert, EUJacobson, PBLink, JT Discovery and metabolic stabilization of potent and selective 2-amino-N-(adamant-2-yl) acetamide 11beta-hydroxysteroid dehydrogenase type 1 inhibitors. J Med Chem50:149-64 (2007) 
 
11-beta-hydroxysteroid dehydrogenase type 2
Name:11-beta-hydroxysteroid dehydrogenase type 2
Type:Enzyme
Mol. Mass.:44141.72
Organism:Homo sapiens (Human)
Description:Purified recombinant human 11beta-HSD2.
Residue:405
BDBM50202094
NameBDBM50202094
Synonyms:CHEMBL375341 | N-(5-hydroxy-adamantan-2-yl)-2-(3-trifluoromethyl-pyrrolidin-1-yl)-acetamide
TypeSmall organic molecule
Emp. Form.C17H25F3N2O2
Mol. Mass.346.3878
SMILESO[C@@]12CC3CC(C1)[C@H](NC(=O)CN1CC[C@@H](C1)C(F)(F)F)C(C3)C2