Reaction Details
Target11-beta-hydroxysteroid dehydrogenase 1
LigandBDBM50202091
Substrate/Competitorn/a
Meas. Tech.ChEMBL_423356 (CHEMBL909897)
IC50 260±n/a nM
Citation Rohde, JJPliushchev, MASorensen, BKWodka, DShuai, QWang, JFung, SMonzon, KMChiou, WJPan, LDeng, XChovan, LERamaiya, AMullally, MHenry, RFStolarik, DFImade, HMMarsh, KCBeno, DWFey, TADroz, BABrune, MECamp, HSSham, HLFrevert, EUJacobson, PBLink, JT Discovery and metabolic stabilization of potent and selective 2-amino-N-(adamant-2-yl) acetamide 11beta-hydroxysteroid dehydrogenase type 1 inhibitors. J Med Chem50:149-64 (2007) 
 
11-beta-hydroxysteroid dehydrogenase 1
Name:11-beta-hydroxysteroid dehydrogenase 1
Type:Enzyme
Mol. Mass.:32409.16
Organism:Homo sapiens (Human)
Description:P28845
Residue:292
BDBM50202091
NameBDBM50202091
Synonyms:CHEMBL384364 | N-adamantan-2-yl-2-[4-(3-cyano-pyridin-2-yl)-piperazin-1-yl]-acetamide
TypeSmall organic molecule
Emp. Form.C22H29N5O
Mol. Mass.379.4986
SMILESO=C(CN1CCN(CC1)c1ncccc1C#N)NC1C2CC3CC(C2)CC1C3