Reaction Details
Target11-beta-hydroxysteroid dehydrogenase 1
LigandBDBM50202102
Substrate/Competitorn/a
Meas. Tech.ChEMBL_423354 (CHEMBL909895)
Ki 5±n/a nM
Citation Rohde, JJPliushchev, MASorensen, BKWodka, DShuai, QWang, JFung, SMonzon, KMChiou, WJPan, LDeng, XChovan, LERamaiya, AMullally, MHenry, RFStolarik, DFImade, HMMarsh, KCBeno, DWFey, TADroz, BABrune, MECamp, HSSham, HLFrevert, EUJacobson, PBLink, JT Discovery and metabolic stabilization of potent and selective 2-amino-N-(adamant-2-yl) acetamide 11beta-hydroxysteroid dehydrogenase type 1 inhibitors. J Med Chem50:149-64 (2007) 
 
11-beta-hydroxysteroid dehydrogenase 1
Name:11-beta-hydroxysteroid dehydrogenase 1
Type:Enzyme
Mol. Mass.:32409.16
Organism:Homo sapiens (Human)
Description:P28845
Residue:292
BDBM50202102
NameBDBM50202102
Synonyms:CHEMBL375156 N-[(E)-5-hydroxy-2-adamantyl]-2-{4-[5-(trifluoromethyl)pyridin-2-yl]piperazin-1-yl}propionamide
TypeSmall organic molecule
Emp. Form.C23H31F3N4O2
Mol. Mass.452.513
SMILESCC(N1CCN(CC1)c1ccc(cn1)C(F)(F)F)C(=O)N[C@H]1C2CC3CC1C[C@](O)(C3)C2