Reaction Details
Target11-beta-hydroxysteroid dehydrogenase 1
LigandBDBM50202097
Substrate/Competitorn/a
Meas. Tech.ChEMBL_423354 (CHEMBL909895)
Ki 8±n/a nM
Citation Rohde, JJPliushchev, MASorensen, BKWodka, DShuai, QWang, JFung, SMonzon, KMChiou, WJPan, LDeng, XChovan, LERamaiya, AMullally, MHenry, RFStolarik, DFImade, HMMarsh, KCBeno, DWFey, TADroz, BABrune, MECamp, HSSham, HLFrevert, EUJacobson, PBLink, JT Discovery and metabolic stabilization of potent and selective 2-amino-N-(adamant-2-yl) acetamide 11beta-hydroxysteroid dehydrogenase type 1 inhibitors. J Med Chem50:149-64 (2007) 
 
11-beta-hydroxysteroid dehydrogenase 1
Name:11-beta-hydroxysteroid dehydrogenase 1
Type:Enzyme
Mol. Mass.:32409.16
Organism:Homo sapiens (Human)
Description:P28845
Residue:292
BDBM50202097
NameBDBM50202097
Synonyms:CHEMBL424937 | N-[(E)-5-hydroxy-2-adamantyl]-2-methyl-2-{4-[5-(trifluoromethyl)pyridin-2-yl]piperazin-1-yl}propanamide
TypeSmall organic molecule
Emp. Form.C24H33F3N4O2
Mol. Mass.466.5396
SMILESCC(C)(N1CCN(CC1)c1ccc(cn1)C(F)(F)F)C(=O)N[C@H]1C2CC3CC1C[C@](O)(C3)C2