Reaction Details
Target11-beta-hydroxysteroid dehydrogenase 1
LigandBDBM50202092
Substrate/Competitorn/a
Meas. Tech.ChEMBL_423354 (CHEMBL909895)
Ki 32±n/a nM
Citation Rohde, JJPliushchev, MASorensen, BKWodka, DShuai, QWang, JFung, SMonzon, KMChiou, WJPan, LDeng, XChovan, LERamaiya, AMullally, MHenry, RFStolarik, DFImade, HMMarsh, KCBeno, DWFey, TADroz, BABrune, MECamp, HSSham, HLFrevert, EUJacobson, PBLink, JT Discovery and metabolic stabilization of potent and selective 2-amino-N-(adamant-2-yl) acetamide 11beta-hydroxysteroid dehydrogenase type 1 inhibitors. J Med Chem50:149-64 (2007) 
 
11-beta-hydroxysteroid dehydrogenase 1
Name:11-beta-hydroxysteroid dehydrogenase 1
Type:Enzyme
Mol. Mass.:32409.16
Organism:Homo sapiens (Human)
Description:P28845
Residue:292
BDBM50202092
NameBDBM50202092
Synonyms:CHEMBL386029 | N-[(E)-5-fluoro-2-adamantyl]-2-{4-[5-(trifluoromethyl)pyridin-2-yl]piperazin-1-yl}acetamide
TypeSmall organic molecule
Emp. Form.C22H28F4N4O
Mol. Mass.440.4775
SMILESFC(F)(F)c1ccc(nc1)N1CCN(CC(=O)N[C@H]2C3CC4CC2C[C@](F)(C4)C3)CC1