Reaction Details
Target11-beta-hydroxysteroid dehydrogenase 1
LigandBDBM50202096
Substrate/Competitorn/a
Meas. Tech.ChEMBL_423355 (CHEMBL909896)
Ki 910±n/a nM
Citation Rohde, JJPliushchev, MASorensen, BKWodka, DShuai, QWang, JFung, SMonzon, KMChiou, WJPan, LDeng, XChovan, LERamaiya, AMullally, MHenry, RFStolarik, DFImade, HMMarsh, KCBeno, DWFey, TADroz, BABrune, MECamp, HSSham, HLFrevert, EUJacobson, PBLink, JT Discovery and metabolic stabilization of potent and selective 2-amino-N-(adamant-2-yl) acetamide 11beta-hydroxysteroid dehydrogenase type 1 inhibitors. J Med Chem50:149-64 (2007) 
 
11-beta-hydroxysteroid dehydrogenase 1
Name:11-beta-hydroxysteroid dehydrogenase 1
Type:Enzyme
Mol. Mass.:32369.70
Organism:Mus musculus (mouse)
Description:P50172
Residue:292
BDBM50202096
NameBDBM50202096
Synonyms:CHEMBL219494 | N-(5-fluoro-7-hydroxyadamantan-2-yl)-2-[4-(5-trifluoromethylpyridin-2-yl)piperazin-1-yl]propionamide
TypeSmall organic molecule
Emp. Form.C23H30F4N4O2
Mol. Mass.470.5035
SMILESCC(N1CCN(CC1)c1ccc(cn1)C(F)(F)F)C(=O)N[C@H]1C2C[C@]3(O)CC1C[C@](F)(C2)C3