Reaction Details
TargetReceptor-type tyrosine-protein kinase FLT3
LigandBDBM33408
Substrate/Competitorn/a
Meas. Tech.ChEMBL_435529 (CHEMBL903889)
IC50 1100±n/a nM
Citation Mahboobi, SUecker, ACénac, CSellmer, AEichhorn, EElz, SBöhmer, FDDove, S Inhibition of FLT3 and PDGFR tyrosine kinase activity by bis(benzo[b]furan-2-yl)methanones. Bioorg Med Chem15:2187-97 (2007) 
 
Receptor-type tyrosine-protein kinase FLT3
Name:Receptor-type tyrosine-protein kinase FLT3
Type:Enzyme
Mol. Mass.:112888.62
Organism:Homo sapiens (Human)
Description:P36888
Residue:993
BDBM33408
NameBDBM33408
Synonyms:AG1295 cid_2048
TypeSmall organic molecule
Emp. Form.C16H14N2
Mol. Mass.234.2958
SMILESCc1cc2ncc(nc2cc1C)-c1ccccc1