Reaction Details
TargetPlatelet-derived growth factor receptor beta
LigandBDBM50202216
Substrate/Competitorn/a
Meas. Tech.ChEMBL_435528 (CHEMBL903888)
IC50 700±n/a nM
Citation Mahboobi, SUecker, ACénac, CSellmer, AEichhorn, EElz, SBöhmer, FDDove, S Inhibition of FLT3 and PDGFR tyrosine kinase activity by bis(benzo[b]furan-2-yl)methanones. Bioorg Med Chem15:2187-97 (2007) 
 
Platelet-derived growth factor receptor beta
Name:Platelet-derived growth factor receptor beta
Type:Enzyme
Mol. Mass.:122771.00
Organism:Mus musculus (mouse)
Description:P05622
Residue:1098
BDBM50202216
NameBDBM50202216
Synonyms:CHEMBL226182 | bis(5-acetoxybenzo[b]furan-2-yl)methanone
TypeSmall organic molecule
Emp. Form.C21H14O7
Mol. Mass.378.3317
SMILESCC(=O)Oc1ccc2oc(cc2c1)C(=O)c1cc2cc(OC(C)=O)ccc2o1