Reaction Details
TargetReceptor-type tyrosine-protein kinase FLT3
LigandBDBM50202218
Substrate/Competitorn/a
Meas. Tech.ChEMBL_435529 (CHEMBL903889)
IC50 3500±n/a nM
Citation Mahboobi, SUecker, ACénac, CSellmer, AEichhorn, EElz, SBöhmer, FDDove, S Inhibition of FLT3 and PDGFR tyrosine kinase activity by bis(benzo[b]furan-2-yl)methanones. Bioorg Med Chem15:2187-97 (2007) 
 
Receptor-type tyrosine-protein kinase FLT3
Name:Receptor-type tyrosine-protein kinase FLT3
Type:Enzyme
Mol. Mass.:112888.62
Organism:Homo sapiens (Human)
Description:P36888
Residue:993
BDBM50202218
NameBDBM50202218
Synonyms:CHEMBL226417 | bis(benzo[b]furan-2-yl)methanone
TypeSmall organic molecule
Emp. Form.C17H10O3
Mol. Mass.262.2595
SMILESO=C(c1cc2ccccc2o1)c1cc2ccccc2o1