Reaction Details
TargetB1 bradykinin receptor
LigandBDBM50202412
Substrate/Competitorn/a
Meas. Tech.ChEMBL_423671 (CHEMBL912896)
IC50 1.52±n/a nM
Citation Kuduk, SDDi Marco, CNChang, RKWood, MRSchirripa, KMKim, JJWai, JMDiPardo, RMMurphy, KLRansom, RWHarrell, CMReiss, DRHolahan, MACook, JHess, JFSain, NUrban, MOTang, CPrueksaritanont, TPettibone, DJBock, MG Development of orally bioavailable and CNS penetrant biphenylaminocyclopropane carboxamide bradykinin B1 receptor antagonists. J Med Chem50:272-82 (2007) 
 
B1 bradykinin receptor
Name:B1 bradykinin receptor
Type:Enzyme
Mol. Mass.:40508.87
Organism:Homo sapiens (Human)
Description:P46663
Residue:353
BDBM50202412
NameBDBM50202412
Synonyms:3-Chloro-3'-fluoro-4'-((R)-1-{[1-(2,2,2-trifluoro-acetylamino)-cyclopropanecarbonyl]-amino}-ethyl)-biphenyl-2-carboxylic acid methyl ester methyl 3-chloro-3'-fluoro-4'-{(1R)-1-[({1-[(trifluoroacetyl)amino]cyclopropyl}carbonyl)amino]ethyl}-1,1'-biphenyl-2-carboxylate
TypeSmall organic molecule
Emp. Form.C22H19ClF4N2O4
Mol. Mass.486.844
SMILESCOC(=O)c1c(Cl)cccc1-c1ccc([C@@H](C)NC(=O)C2(CC2)NC(=O)C(F)(F)F)c(F)c1