Reaction Details
TargetB2 bradykinin receptor
LigandBDBM50202411
Substrate/Competitorn/a
Meas. Tech.ChEMBL_423710 (CHEMBL913022)
IC50>10000±n/a nM
Citation Kuduk, SDDi Marco, CNChang, RKWood, MRSchirripa, KMKim, JJWai, JMDiPardo, RMMurphy, KLRansom, RWHarrell, CMReiss, DRHolahan, MACook, JHess, JFSain, NUrban, MOTang, CPrueksaritanont, TPettibone, DJBock, MG Development of orally bioavailable and CNS penetrant biphenylaminocyclopropane carboxamide bradykinin B1 receptor antagonists. J Med Chem50:272-82 (2007) 
 
B2 bradykinin receptor
Name:B2 bradykinin receptor
Type:Enzyme Catalytic Domain
Mol. Mass.:44467.17
Organism:Homo sapiens (Human)
Description:B2 BRADYKININ BDKRB2 HUMAN::P30411
Residue:391
BDBM50202411
NameBDBM50202411
Synonyms:CHEMBL218267 | methyl 4'-({[(1-{[chloro(difluoro)acetyl]amino}cyclopropyl)-carbonyl]amino}methyl)-3,3'-difluoro-1,1'-biphenyl-2-carboxylate
TypeSmall organic molecule
Emp. Form.C21H17ClF4N2O4
Mol. Mass.472.817
SMILESCOC(=O)c1c(F)cccc1-c1ccc(CNC(=O)C2(CC2)NC(=O)C(F)(F)Cl)c(F)c1