Reaction Details
TargetMelanin-concentrating hormone receptor 1
LigandBDBM50202674
Substrate/Competitorn/a
Meas. Tech.ChEMBL_421700 (CHEMBL854908)
IC50 47±n/a nM
Citation Iyengar, RRLynch, JKMulhern, MMJudd, ASFreeman, JCGao, JSouers, AJZhao, GWodka, DDoug Falls, HBrodjian, SDayton, BDReilly, RMSwanson, SSu, ZMartin, RLLeitza, STHouseman, KADiaz, GCollins, CASham, HLKym, PR An evaluation of 3,4-methylenedioxy phenyl replacements in the aminopiperidine chromone class of MCHr1 antagonists. Bioorg Med Chem Lett17:874-8 (2007) 
 
Melanin-concentrating hormone receptor 1
Name:Melanin-concentrating hormone receptor 1
Type:G Protein-Coupled Receptor (GPCR)
Mol. Mass.:45976.27
Organism:Homo sapiens (Human)
Description:Membranes from CHO-K1 cells stably expressing human MCH1R were used in assays.
Residue:422
BDBM50202674
NameBDBM50202674
Synonyms:CHEMBL269352 | N-(1-(3-acetamidobenzyl)piperidin-4-yl)-7-fluoro-4-oxo-4H-chromene-2-carboxamide
TypeSmall organic molecule
Emp. Form.C24H24FN3O4
Mol. Mass.437.4635
SMILESCC(=O)Nc1cccc(CN2CCC(CC2)NC(=O)c2cc(=O)c3ccc(F)cc3o2)c1