Reaction Details
TargetVasopressin V1a receptor
LigandBDBM50202860
Substrate/Competitorn/a
Meas. Tech.ChEMBL_441650 (CHEMBL891881)
Ki 0.66±n/a nM
Citation Guillon, CDKoppel, GABrownstein, MJChaney, MOFerris, CFLu, SFFabio, KMMiller, MJHeindel, NDHunden, DCCooper, RDKaldor, SWSkelton, JJDressman, BAClay, MPSteinberg, MIBruns, RFSimon, NG Azetidinones as vasopressin V1a antagonists. Bioorg Med Chem15:2054-80 (2007) 
 
Vasopressin V1a receptor
Name:Vasopressin V1a receptor
Type:Receptor
Mol. Mass.:46820.18
Organism:Homo sapiens (Human)
Description:P37288
Residue:418
BDBM50202860
NameBDBM50202860
Synonyms:2(R)-[[4-(piperidin-1-yl)piperidin-1-yl]carbonylmethyl]-2-[3(S)-(4(S)-phenyloxazolidin-2-on-3-yl)-4(R)-(2-styryl)azetidin-2-on-1-yl]acetic acid N-methyl-N-(3-trifluoromethylbenzyl)amide | CHEMBL279328
TypeSmall organic molecule
Emp. Form.C43H48F3N5O5
Mol. Mass.771.8669
SMILESCN(Cc1cccc(c1)C(F)(F)F)C(=O)[C@@H](CC(=O)N1CCC(CC1)N1CCCCC1)N1[C@H](\C=C\c2ccccc2)[C@H](N2[C@H](COC2=O)c2ccccc2)C1=O