Reaction Details
TargetVasopressin V1a receptor
LigandBDBM50202869
Substrate/Competitorn/a
Meas. Tech.ChEMBL_441650 (CHEMBL891881)
Ki 0.93±n/a nM
Citation Guillon, CDKoppel, GABrownstein, MJChaney, MOFerris, CFLu, SFFabio, KMMiller, MJHeindel, NDHunden, DCCooper, RDKaldor, SWSkelton, JJDressman, BAClay, MPSteinberg, MIBruns, RFSimon, NG Azetidinones as vasopressin V1a antagonists. Bioorg Med Chem15:2054-80 (2007) 
 
Vasopressin V1a receptor
Name:Vasopressin V1a receptor
Type:Receptor
Mol. Mass.:46820.18
Organism:Homo sapiens (Human)
Description:P37288
Residue:418
BDBM50202869
NameBDBM50202869
Synonyms:(S)-N-(2-(trifluoromethyl)benzyl)-5-(4-cyclohexylpiperazin-1-yl)-5-oxo-2-((3S,4R)-2-oxo-3-((S)-2-oxo-4-phenyloxazolidin-3-yl)-4-((E)-styryl)azetidin-1-yl)pentanamide | CHEMBL394867
TypeSmall organic molecule
Emp. Form.C43H48F3N5O5
Mol. Mass.771.8669
SMILESFC(F)(F)c1ccccc1CNC(=O)[C@H](CCC(=O)N1CCN(CC1)C1CCCCC1)N1[C@H](\C=C\c2ccccc2)[C@H](N2[C@H](COC2=O)c2ccccc2)C1=O