Reaction Details
TargetVasopressin V1a receptor
LigandBDBM50202871
Substrate/Competitorn/a
Meas. Tech.ChEMBL_441650 (CHEMBL891881)
Ki 0.66±n/a nM
Citation Guillon, CDKoppel, GABrownstein, MJChaney, MOFerris, CFLu, SFFabio, KMMiller, MJHeindel, NDHunden, DCCooper, RDKaldor, SWSkelton, JJDressman, BAClay, MPSteinberg, MIBruns, RFSimon, NG Azetidinones as vasopressin V1a antagonists. Bioorg Med Chem15:2054-80 (2007) 
 
Vasopressin V1a receptor
Name:Vasopressin V1a receptor
Type:Receptor
Mol. Mass.:46820.18
Organism:Homo sapiens (Human)
Description:P37288
Residue:418
BDBM50202871
NameBDBM50202871
Synonyms:(S)-N-(3-chlorobenzyl)-5-(4-cyclohexylpiperazin-1-yl)-5-oxo-2-((3S,4R)-2-oxo-3-((S)-2-oxo-4-phenyloxazolidin-3-yl)-4-((E)-styryl)azetidin-1-yl)pentanamide | CHEMBL446720
TypeSmall organic molecule
Emp. Form.C42H48ClN5O5
Mol. Mass.738.314
SMILESClc1cccc(CNC(=O)[C@H](CCC(=O)N2CCN(CC2)C2CCCCC2)N2[C@H](\C=C\c3ccccc3)[C@H](N3[C@H](COC3=O)c3ccccc3)C2=O)c1