Reaction Details
TargetPotassium voltage-gated channel subfamily H member 2
LigandBDBM50198574
Substrate/Competitorn/a
Meas. Tech.ChEMBL_435561 (CHEMBL903920)
IC50 3300±n/a nM
Citation Méndez-Andino, JLColson, AOMeyers, KMMitchell, MCHodge, KHoward, JMKim, NAckley, DCHolbert, JKMittelstadt, SWDowty, MEObringer, CMSuchanek, PReizes, OHu, XEWos, JA The efficacy and cardiac evaluation of aminomethyl tetrahydronaphthalene ketopiperazines: a novel class of potent MCH-R1 antagonists. Bioorg Med Chem15:2092-105 (2007) 
 
Potassium voltage-gated channel subfamily H member 2
Name:Potassium voltage-gated channel subfamily H member 2
Type:Multi-pass membrane protein
Mol. Mass.:126672.65
Organism:Homo sapiens (Human)
Description:Q12809
Residue:1159
BDBM50198574
NameBDBM50198574
Synonyms:(S)-4-(4-chlorophenethyl)-1-(6-((diethylamino)-methyl)-1,2,3,4-tetrahydronaphthalen-2-yl)piperazin-2-one CHEMBL384400
TypeSmall organic molecule
Emp. Form.C27H36ClN3O
Mol. Mass.454.047
SMILESCCN(CC)Cc1ccc2C[C@H](CCc2c1)N1CCN(CCc2ccc(Cl)cc2)CC1=O