Reaction Details
TargetCarbonic anhydrase 14
LigandBDBM26996
Substrate/Competitorn/a
Meas. Tech.ChEMBL_458929 (CHEMBL924948)
Ki 92000±n/a nM
Citation Innocenti, AVullo, DPastorek, JScozzafava, APastorekova, SNishimori, ISupuran, CT Carbonic anhydrase inhibitors. Inhibition of transmembrane isozymes XII (cancer-associated) and XIV with anions. Bioorg Med Chem Lett17:1532-7 (2007) 
 
Carbonic anhydrase 14
Name:Carbonic anhydrase 14
Type:Enzyme
Mol. Mass.:37665.67
Organism:Homo sapiens (Human)
Description:Human (cloned) isozyme.
Residue:337
BDBM26996
NameBDBM26996
Synonyms:CHEMBL21485 Phenyl-boronic acid benzeneboronic acid phenylboronic acid
Typen/a
Emp. Form.C6H7BO2
Mol. Mass.121.93
SMILESOB(O)c1ccccc1