Reaction Details
TargetCarbonic anhydrase 1
LigandBDBM26997
Substrate/Competitorn/a
Meas. Tech.ChEMBL_458925 (CHEMBL924944)
Ki 31700000±n/a nM
Citation Innocenti, AVullo, DPastorek, JScozzafava, APastorekova, SNishimori, ISupuran, CT Carbonic anhydrase inhibitors. Inhibition of transmembrane isozymes XII (cancer-associated) and XIV with anions. Bioorg Med Chem Lett17:1532-7 (2007) 
 
Carbonic anhydrase 1
Name:Carbonic anhydrase 1
Type:Enzyme
Mol. Mass.:28873.37
Organism:Homo sapiens (Human)
Description:P00915
Residue:261
BDBM26997
NameBDBM26997
Synonyms:CHEMBL364571 benzenarsonic acid phenylarsonic acid
Typen/a
Emp. Form.C6H7AsO3
Mol. Mass.202.0396
SMILESO[As](O)(=O)c1ccccc1