Reaction Details
TargetCarbonic anhydrase 12
LigandBDBM26994
Substrate/Competitorn/a
Meas. Tech.ChEMBL_458928 (CHEMBL924947)
Ki 700000±n/a nM
Citation Innocenti, AVullo, DPastorek, JScozzafava, APastorekova, SNishimori, ISupuran, CT Carbonic anhydrase inhibitors. Inhibition of transmembrane isozymes XII (cancer-associated) and XIV with anions. Bioorg Med Chem Lett17:1532-7 (2007) 
 
Carbonic anhydrase 12
Name:Carbonic anhydrase 12
Type:Enzyme
Mol. Mass.:39456.00
Organism:Homo sapiens (Human)
Description:Catalytic domain of human cloned isozyme was used in the assay
Residue:354
BDBM26994
NameBDBM26994
Synonyms:CHEMBL68253 sulfamic acid
Typen/a
Emp. Form.H3NO3S
Mol. Mass.97.094
SMILESNS(O)(=O)=O