Reaction Details
TargetCarbonic anhydrase 2
LigandBDBM26994
Substrate/Competitorn/a
Meas. Tech.ChEMBL_458926 (CHEMBL924945)
Ki 390000±n/a nM
Citation Innocenti, AVullo, DPastorek, JScozzafava, APastorekova, SNishimori, ISupuran, CT Carbonic anhydrase inhibitors. Inhibition of transmembrane isozymes XII (cancer-associated) and XIV with anions. Bioorg Med Chem Lett17:1532-7 (2007) 
 
Carbonic anhydrase 2
Name:Carbonic anhydrase 2
Type:Enzyme
Mol. Mass.:29250.71
Organism:Homo sapiens (Human)
Description:P00918
Residue:260
BDBM26994
NameBDBM26994
Synonyms:CHEMBL68253 sulfamic acid
Typen/a
Emp. Form.H3NO3S
Mol. Mass.97.094
SMILESNS(O)(=O)=O