Reaction Details
TargetDisintegrin and metalloproteinase domain-containing protein 17
LigandBDBM50204389
Substrate/Competitorn/a
Meas. Tech.ChEMBL_447058 (CHEMBL897359)
IC50 1.2±n/a nM
Citation Chen, XTGhavimi, BCorbett, RLXue, CBLiu, RQCovington, MBQian, MVaddi, KGChrist, DDHartman, KDRibadeneira, MDTrzaskos, JMNewton, RCDecicco, CPDuan, JJ A new 4-(2-methylquinolin-4-ylmethyl)phenyl P1' group for the beta-amino hydroxamic acid derived TACE inhibitors. Bioorg Med Chem Lett17:1865-70 (2007) 
 
Disintegrin and metalloproteinase domain-containing protein 17
Name:Disintegrin and metalloproteinase domain-containing protein 17
Type:Metalloprotease
Mol. Mass.:12197.99
Organism:Sus scrofa (pig)
Description:Partially purified TACE was obtained from porcine spleen.
Residue:112
BDBM50204389
NameBDBM50204389
Synonyms:(3R,4R)-4-(4-((2,3-dimethylquinolin-4-yl)methyl)benzamido)-N-hydroxy-tetrahydro-2H-pyran-3-carboxamide | CHEMBL234417
TypeSmall organic molecule
Emp. Form.C25H27N3O4
Mol. Mass.433.4996
SMILESCc1nc2ccccc2c(Cc2ccc(cc2)C(=O)N[C@@H]2CCOC[C@@H]2C(=O)NO)c1C