Reaction Details
TargetDisintegrin and metalloproteinase domain-containing protein 17
LigandBDBM50204388
Substrate/Competitorn/a
Meas. Tech.ChEMBL_447058 (CHEMBL897359)
IC50 1.3±n/a nM
Citation Chen, XTGhavimi, BCorbett, RLXue, CBLiu, RQCovington, MBQian, MVaddi, KGChrist, DDHartman, KDRibadeneira, MDTrzaskos, JMNewton, RCDecicco, CPDuan, JJ A new 4-(2-methylquinolin-4-ylmethyl)phenyl P1' group for the beta-amino hydroxamic acid derived TACE inhibitors. Bioorg Med Chem Lett17:1865-70 (2007) 
 
Disintegrin and metalloproteinase domain-containing protein 17
Name:Disintegrin and metalloproteinase domain-containing protein 17
Type:Metalloprotease
Mol. Mass.:12197.99
Organism:Sus scrofa (pig)
Description:Partially purified TACE was obtained from porcine spleen.
Residue:112
BDBM50204388
NameBDBM50204388
Synonyms:(3S,4S)-tert-butyl 3-(hydroxycarbamoyl)-4-(4-(2-methylquinolin-4-yloxy)benzamido)pyrrolidine-1-carboxylate | CHEMBL398371
TypeSmall organic molecule
Emp. Form.C27H30N4O6
Mol. Mass.506.5503
SMILESCc1cc(Oc2ccc(cc2)C(=O)N[C@@H]2CN(C[C@@H]2C(=O)NO)C(=O)OC(C)(C)C)c2ccccc2n1