Reaction Details
TargetMatrix metalloproteinase-15
LigandBDBM50204392
Substrate/Competitorn/a
Meas. Tech.ChEMBL_447091 (CHEMBL897392)
IC50>7000±n/a nM
Citation Chen, XTGhavimi, BCorbett, RLXue, CBLiu, RQCovington, MBQian, MVaddi, KGChrist, DDHartman, KDRibadeneira, MDTrzaskos, JMNewton, RCDecicco, CPDuan, JJ A new 4-(2-methylquinolin-4-ylmethyl)phenyl P1' group for the beta-amino hydroxamic acid derived TACE inhibitors. Bioorg Med Chem Lett17:1865-70 (2007) 
 
Matrix metalloproteinase-15
Name:Matrix metalloproteinase-15
Type:PROTEIN
Mol. Mass.:75814.08
Organism:Homo sapiens (Human)
Description:ChEMBL_106793
Residue:669
BDBM50204392
NameBDBM50204392
Synonyms:(3R,4R)-N-hydroxy-4-(4-((2-methylquinolin-4-yl)methyl)benzamido)-tetrahydro-2H-pyran-3-carboxamide | CHEMBL234034
TypeSmall organic molecule
Emp. Form.C24H25N3O4
Mol. Mass.419.473
SMILESCc1cc(Cc2ccc(cc2)C(=O)N[C@@H]2CCOC[C@@H]2C(=O)NO)c2ccccc2n1