Reaction Details
TargetDisintegrin and metalloproteinase domain-containing protein 17
LigandBDBM50204395
Substrate/Competitorn/a
Meas. Tech.ChEMBL_447058 (CHEMBL897359)
IC50 1.5±n/a nM
Citation Chen, XTGhavimi, BCorbett, RLXue, CBLiu, RQCovington, MBQian, MVaddi, KGChrist, DDHartman, KDRibadeneira, MDTrzaskos, JMNewton, RCDecicco, CPDuan, JJ A new 4-(2-methylquinolin-4-ylmethyl)phenyl P1' group for the beta-amino hydroxamic acid derived TACE inhibitors. Bioorg Med Chem Lett17:1865-70 (2007) 
 
Disintegrin and metalloproteinase domain-containing protein 17
Name:Disintegrin and metalloproteinase domain-containing protein 17
Type:Metalloprotease
Mol. Mass.:12197.99
Organism:Sus scrofa (pig)
Description:Partially purified TACE was obtained from porcine spleen.
Residue:112
BDBM50204395
NameBDBM50204395
Synonyms:(3S,4S)-N-hydroxy-4-(4-((2-methylquinolin-4-yl)methyl)benzamido)-1-pivaloylpyrrolidine-3-carboxamide | CHEMBL401453
TypeSmall organic molecule
Emp. Form.C28H32N4O4
Mol. Mass.488.5781
SMILESCc1cc(Cc2ccc(cc2)C(=O)N[C@@H]2CN(C[C@@H]2C(=O)NO)C(=O)C(C)(C)C)c2ccccc2n1