Reaction Details
TargetMetabotropic glutamate receptor 1
LigandBDBM50204429
Substrate/Competitorn/a
Meas. Tech.ChEMBL_442080 (CHEMBL891221)
IC50 71±n/a nM
Citation Di Fabio, RMicheli, FAlvaro, GCavanni, PDonati, DGagliardi, TFontana, GGiovannini, RMaffeis, MMingardi, ATranquillini, MEVitulli, G From pyrroles to 1-oxo-2,3,4,9-tetrahydro-1H-beta-carbolines: a new class of orally bioavailable mGluR1 antagonists. Bioorg Med Chem Lett17:2254-9 (2007) 
 
Metabotropic glutamate receptor 1
Name:Metabotropic glutamate receptor 1
Type:Enzyme Catalytic Domain
Mol. Mass.:133240.47
Organism:RAT
Description:metabotropic glutamate 1/2 0 RAT::P23385
Residue:1199
BDBM50204429
NameBDBM50204429
Synonyms:CHEMBL388669 | adamantane-1-carboxylic acid (1-oxo-2,3,4,9-tetrahydro-1H-beta-carbolin-6-yl)-amide
TypeSmall organic molecule
Emp. Form.C22H25N3O2
Mol. Mass.363.4528
SMILESO=C(Nc1ccc2[nH]c3c(CCNC3=O)c2c1)C12CC3CC(CC(C3)C1)C2