Reaction Details
TargetSerine/threonine-protein kinase Chk1
LigandBDBM50204699
Substrate/Competitorn/a
Meas. Tech.ChEMBL_442099 (CHEMBL891237)
IC50 29±n/a nM
Citation Tong, YClaiborne, AStewart, KDPark, CKovar, PChen, ZCredo, RBGu, WZGwaltney, SLJudge, RAZhang, HRosenberg, SHSham, HLSowin, TJLin, NH Discovery of 1,4-dihydroindeno[1,2-c]pyrazoles as a novel class of potent and selective checkpoint kinase 1 inhibitors. Bioorg Med Chem15:2759-67 (2007) 
 
Serine/threonine-protein kinase Chk1
Name:Serine/threonine-protein kinase Chk1
Type:Enzyme Catalytic Domain
Mol. Mass.:54443.02
Organism:Homo sapiens (Human)
Description:gi_166295192
Residue:476
BDBM50204699
NameBDBM50204699
Synonyms:4-(6-((4-hydroxypiperidin-1-yl)methyl)-1,4-dihydroindeno[1,2-c]pyrazol-3-yl)benzamide | CHEMBL243188
TypeSmall organic molecule
Emp. Form.C23H24N4O2
Mol. Mass.388.4623
SMILESNC(=O)c1ccc(cc1)-c1n[nH]c-2c1Cc1cc(CN3CCC(O)CC3)ccc-21