Reaction Details
TargetRAC-alpha/RAC-beta/RAC-gamma serine/threonine-protein kinase
LigandBDBM50204693
Substrate/Competitorn/a
Meas. Tech.ChEMBL_442114 (CHEMBL891252)
IC50 1580±n/a nM
Citation Tong, YClaiborne, AStewart, KDPark, CKovar, PChen, ZCredo, RBGu, WZGwaltney, SLJudge, RAZhang, HRosenberg, SHSham, HLSowin, TJLin, NH Discovery of 1,4-dihydroindeno[1,2-c]pyrazoles as a novel class of potent and selective checkpoint kinase 1 inhibitors. Bioorg Med Chem15:2759-67 (2007) 
 
RAC-alpha/RAC-beta/RAC-gamma serine/threonine-protein kinase
Name:RAC-alpha/RAC-beta/RAC-gamma serine/threonine-protein kinase
Synonyms:Serine/threonine-protein kinase AKT
Type:n/a
Mol. Mass.:n/a
Description:ASSAY_ID of ChEMBL is 30507
Components:This complex has 3 components.
Component 1
Name:RAC-beta serine/threonine-protein kinase
Type:Enzyme
Mol. Mass.:55766.64
Organism:Homo sapiens (Human)
Description:n/a
Residue:481
Component 2
Name:RAC-gamma serine/threonine-protein kinase
Synonyms:AKT3 PKB gamma Protein kinase Akt-3 Protein kinase B, gamma RAC-gamma serine/threonine-protein kinase Serine/threonine-protein kinase AKT | Serine/threonine-protein kinase AKT3
Type:Enzyme
Mol. Mass.:55769.36
Organism:Homo sapiens (Human)
Description:n/a
Residue:479
Component 3
Name:RAC-alpha serine/threonine-protein kinase
Synonyms:AKT phosphorylation (p-AKT) AKT1/PPP1CA C-AKT PKB alpha Protein kinase B Protein kinase B (Akt 1) Protein kinase B alpha Proto-oncogene Akt (Akt1) Proto-oncogene c-Akt (AKT1) RAC-PK-alpha RAC-alpha serine/threonine-protein kinase (AKT1) | RAC-alpha serine/threonine-protein kinase (pAKT)
Type:Enzyme
Mol. Mass.:55681.25
Organism:Homo sapiens (Human)
Description:P31749
Residue:480
BDBM50204693
NameBDBM50204693
Synonyms:3-(4'-hydroxy-biphenyl-4-yl)-1,4-dihydro-indeno[1,2-c]pyrazole-6-carboxylic acid (pyridin-4-ylmethyl)-amide | CHEMBL242753
TypeSmall organic molecule
Emp. Form.C29H22N4O2
Mol. Mass.458.5106
SMILESOc1ccc(cc1)-c1ccc(cc1)-c1n[nH]c-2c1Cc1cc(ccc-21)C(=O)NCc1ccncc1