Reaction Details
TargetSerine/threonine-protein kinase Chk1
LigandBDBM50204692
Substrate/Competitorn/a
Meas. Tech.ChEMBL_442099 (CHEMBL891237)
IC50 481±n/a nM
Citation Tong, YClaiborne, AStewart, KDPark, CKovar, PChen, ZCredo, RBGu, WZGwaltney, SLJudge, RAZhang, HRosenberg, SHSham, HLSowin, TJLin, NH Discovery of 1,4-dihydroindeno[1,2-c]pyrazoles as a novel class of potent and selective checkpoint kinase 1 inhibitors. Bioorg Med Chem15:2759-67 (2007) 
 
Serine/threonine-protein kinase Chk1
Name:Serine/threonine-protein kinase Chk1
Type:Enzyme Catalytic Domain
Mol. Mass.:54443.02
Organism:Homo sapiens (Human)
Description:gi_166295192
Residue:476
BDBM50204692
NameBDBM50204692
Synonyms:(1r,4r)-N-((3-(4-chlorophenyl)-1,4-dihydroindeno[1,2-c]pyrazol-6-yl)methyl)-4-methylcyclohexanamine | CHEMBL390024
TypeSmall organic molecule
Emp. Form.C24H26ClN3
Mol. Mass.391.936
SMILESC[C@H]1CC[C@@H](CC1)NCc1ccc-2c(Cc3c(n[nH]c-23)-c2ccc(Cl)cc2)c1