Reaction Details
TargetNeuropeptide Y receptor type 2
LigandBDBM50205093
Substrate/Competitorn/a
Meas. Tech.ChEMBL_447172 (CHEMBL897470)
Ki 5±n/a nM
Citation DeCarr, LBBuckholz, TMMilardo, LFMays, MROrtiz, ALumb, KJ A long-acting selective neuropeptide Y2 receptor PEGylated peptide agonist reduces food intake in mice. Bioorg Med Chem Lett17:1916-9 (2007) 
 
Neuropeptide Y receptor type 2
Name:Neuropeptide Y receptor type 2
Type:Enzyme Catalytic Domain
Mol. Mass.:42734.65
Organism:Homo sapiens (Human)
Description:NPY-Y2 NPY2R HUMAN::P49146
Residue:381
BDBM50205093
NameBDBM50205093
Synonyms:CHEMBL428017 | LRHYLNLLTRQRY-NH2
TypeSmall organic molecule
Emp. Form.C81H131N27O19
Mol. Mass.1787.0763
SMILESCC(C)C[C@H](NC(C)=O)C(=O)N[C@@H](CCCN=C(N)N)C(=O)N[C@@H](Cc1cnc[nH]1)C(=O)N[C@@H](Cc1ccc(O)cc1)C(=O)N[C@@H](CC(C)C)C(=O)N[C@@H](CC(N)=O)C(=O)N[C@@H](CC(C)C)C(=O)N[C@@H](CC(C)C)C(=O)N[C@@H]([C@@H](C)O)C(=O)N[C@@H](CCCN=C(N)N)C(=O)N[C@@H](CCC(N)=O)C(=O)N[C@@H](CCCN=C(N)N)C(=O)N[C@@H](Cc1ccc(O)cc1)C(N)=O