Reaction Details
TargetThymidine kinase
LigandBDBM50205239
Substrate/Competitorn/a
Meas. Tech.ChEMBL_428150 (CHEMBL915787)
IC50>500000±n/a nM
Citation Chitneni, SKDeroose, CMBalzarini, JGijsbers, RCelen, SJde Groot, TJDebyser, ZMortelmans, LVerbruggen, AMBormans, GM Synthesis and preliminary evaluation of 18F- or 11C-labeled bicyclic nucleoside analogues as potential probes for imaging varicella-zoster virus thymidine kinase gene expression using positron emission tomography. J Med Chem50:1041-9 (2007) 
 
Thymidine kinase
Name:Thymidine kinase
Type:PROTEIN
Mol. Mass.:40902.47
Organism:Human herpesvirus 1 (strain SC16) (HHV-1) (Human herpes simplex virus1)
Description:ChEMBL_474154
Residue:376
BDBM50205239
NameBDBM50205239
Synonyms:3-((2R,4S,5R)-4-hydroxy-5-(hydroxymethyl)-tetrahydrofuran-2-yl)-6-(3-hydroxyphenyl)furo[2,3-d]pyrimidin-2(3H)-one CHEMBL375147
TypeSmall organic molecule
Emp. Form.C17H16N2O6
Mol. Mass.344.3187
SMILESOC[C@H]1O[C@H](C[C@@H]1O)n1cc2cc(oc2nc1=O)-c1cccc(O)c1