Reaction Details
TargetAdenosine receptor A3
LigandBDBM50205279
Substrate/Competitorn/a
Meas. Tech.ChEMBL_425911 (CHEMBL907971)
Ki 180±n/a nM
Citation Chang, LCvon Frijtag Drabbe Künzel, JKMulder-Krieger, TWesterhout, JSpangenberg, TBrussee, JIjzerman, AP 2,6,8-trisubstituted 1-deazapurines as adenosine receptor antagonists. J Med Chem50:828-34 (2007) 
 
Adenosine receptor A3
Name:Adenosine receptor A3
Type:G Protein-Coupled Receptor (GPCR)
Mol. Mass.:36197.32
Organism:Homo sapiens (Human)
Description:P0DMS8
Residue:318
BDBM50205279
NameBDBM50205279
Synonyms:2,6-diphenyl-1-deazapurine | CHEMBL220535
TypeSmall organic molecule
Emp. Form.C18H13N3
Mol. Mass.271.3159
SMILESc1nc2c(cc(nc2[nH]1)-c1ccccc1)-c1ccccc1