Reaction Details
TargetAdenosine receptor A1
LigandBDBM50205279
Substrate/Competitorn/a
Meas. Tech.ChEMBL_425907 (CHEMBL907967)
Ki 1.2±n/a nM
Citation Chang, LCvon Frijtag Drabbe Künzel, JKMulder-Krieger, TWesterhout, JSpangenberg, TBrussee, JIjzerman, AP 2,6,8-trisubstituted 1-deazapurines as adenosine receptor antagonists. J Med Chem50:828-34 (2007) 
 
Adenosine receptor A1
Name:Adenosine receptor A1
Type:G Protein-Coupled Receptor (GPCR)
Mol. Mass.:36520.92
Organism:Homo sapiens (Human)
Description:P30542
Residue:326
BDBM50205279
NameBDBM50205279
Synonyms:2,6-diphenyl-1-deazapurine | CHEMBL220535
TypeSmall organic molecule
Emp. Form.C18H13N3
Mol. Mass.271.3159
SMILESc1nc2c(cc(nc2[nH]1)-c1ccccc1)-c1ccccc1