Reaction Details
TargetAdenosine receptor A1
LigandBDBM50205290
Substrate/Competitorn/a
Meas. Tech.ChEMBL_425907 (CHEMBL907967)
Ki 2.5±n/a nM
Citation Chang, LCvon Frijtag Drabbe Künzel, JKMulder-Krieger, TWesterhout, JSpangenberg, TBrussee, JIjzerman, AP 2,6,8-trisubstituted 1-deazapurines as adenosine receptor antagonists. J Med Chem50:828-34 (2007) 
 
Adenosine receptor A1
Name:Adenosine receptor A1
Type:G Protein-Coupled Receptor (GPCR)
Mol. Mass.:36520.92
Organism:Homo sapiens (Human)
Description:P30542
Residue:326
BDBM50205290
NameBDBM50205290
Synonyms:2,6-dphenyl-8-propyl-1-deazapurine | CHEMBL376648
TypeSmall organic molecule
Emp. Form.C21H19N3
Mol. Mass.313.3957
SMILESCCCc1nc2c(cc(nc2[nH]1)-c1ccccc1)-c1ccccc1