Reaction Details
TargetAdenosine receptor A2a
LigandBDBM50205279
Substrate/Competitorn/a
Meas. Tech.ChEMBL_425909 (CHEMBL907969)
Ki 39±n/a nM
Citation Chang, LCvon Frijtag Drabbe Künzel, JKMulder-Krieger, TWesterhout, JSpangenberg, TBrussee, JIjzerman, AP 2,6,8-trisubstituted 1-deazapurines as adenosine receptor antagonists. J Med Chem50:828-34 (2007) 
 
Adenosine receptor A2a
Name:Adenosine receptor A2a
Type:G Protein-Coupled Receptor (GPCR)
Mol. Mass.:44716.46
Organism:Homo sapiens (Human)
Description:P29274
Residue:412
BDBM50205279
NameBDBM50205279
Synonyms:2,6-diphenyl-1-deazapurine | CHEMBL220535
TypeSmall organic molecule
Emp. Form.C18H13N3
Mol. Mass.271.3159
SMILESc1nc2c(cc(nc2[nH]1)-c1ccccc1)-c1ccccc1