Reaction Details
TargetKappa-type opioid receptor
LigandBDBM50205443
Substrate/Competitorn/a
Meas. Tech.ChEMBL_438364 (CHEMBL887466)
Ki 151±n/a nM
Citation Bikbulatov, RVYan, FRoth, BLZjawiony, JK Convenient synthesis and in vitro pharmacological activity of 2-thioanalogs of salvinorins A and B. Bioorg Med Chem Lett17:2229-32 (2007) 
 
Kappa-type opioid receptor
Name:Kappa-type opioid receptor
Type:G Protein-Coupled Receptor (GPCR)
Mol. Mass.:42692.90
Organism:Rattus norvegicus (rat)
Description:P34975
Residue:380
BDBM50205443
NameBDBM50205443
Synonyms:2-epi-2-thiosalvinorin A | CHEMBL231537
TypeSmall organic molecule
Emp. Form.C23H28O7S
Mol. Mass.448.529
SMILESCOC(=O)[C@@H]1C[C@@H](SC(C)=O)C(=O)[C@H]2[C@@]1(C)CC[C@H]1C(=O)O[C@@H](C[C@]21C)c1ccoc1