Reaction Details
TargetBeta-2 adrenergic receptor
LigandBDBM50205508
Substrate/Competitorn/a
Meas. Tech.ChEMBL_435752 (CHEMBL920283)
Ki 501±n/a nM
Citation Dallanoce, CFrigerio, FDe Amici, MDorsch, SKlotz, KNDe Micheli, C Novel chiral isoxazole derivatives: synthesis and pharmacological characterization at human beta-adrenergic receptor subtypes. Bioorg Med Chem15:2533-43 (2007) 
 
Beta-2 adrenergic receptor
Name:Beta-2 adrenergic receptor
Type:n/a
Mol. Mass.:46461.69
Organism:Homo sapiens (Human)
Description:P07550
Residue:413
BDBM50205508
NameBDBM50205508
Synonyms:(R,R)-(+)-{4-[2-{[2-(3-bromoisoxazol-5-yl)-2-hydroxyethyl]-amino}propyl]phenoxy}acetic acid | CHEMBL226293
TypeSmall organic molecule
Emp. Form.C16H19BrN2O5
Mol. Mass.399.236
SMILESC[C@H](Cc1ccc(OCC(O)=O)cc1)NC[C@@H](O)c1cc(Br)no1