Reaction Details
TargetBeta-1 adrenergic receptor
LigandBDBM50205505
Substrate/Competitorn/a
Meas. Tech.ChEMBL_435751 (CHEMBL920282)
Ki>100000±n/a nM
Citation Dallanoce, CFrigerio, FDe Amici, MDorsch, SKlotz, KNDe Micheli, C Novel chiral isoxazole derivatives: synthesis and pharmacological characterization at human beta-adrenergic receptor subtypes. Bioorg Med Chem15:2533-43 (2007) 
 
Beta-1 adrenergic receptor
Name:Beta-1 adrenergic receptor
Type:G Protein-Coupled Receptor (GPCR)
Mol. Mass.:51338.40
Organism:Homo sapiens (Human)
Description:P08588
Residue:477
BDBM50205505
NameBDBM50205505
Synonyms:(+/-)-N-[5-(2-bromo-1-hydroxyethyl)isoxazol-3-yl]methanesulfonamide | CHEMBL226292
TypeSmall organic molecule
Emp. Form.C10H19N3O4S
Mol. Mass.277.341
SMILESCC(C)(C)NCC(O)c1cc(NS(C)(=O)=O)no1