Reaction Details
TargetBeta-1 adrenergic receptor
LigandBDBM50205509
Substrate/Competitorn/a
Meas. Tech.ChEMBL_435751 (CHEMBL920282)
Ki 1110±n/a nM
Citation Dallanoce, CFrigerio, FDe Amici, MDorsch, SKlotz, KNDe Micheli, C Novel chiral isoxazole derivatives: synthesis and pharmacological characterization at human beta-adrenergic receptor subtypes. Bioorg Med Chem15:2533-43 (2007) 
 
Beta-1 adrenergic receptor
Name:Beta-1 adrenergic receptor
Type:G Protein-Coupled Receptor (GPCR)
Mol. Mass.:51338.40
Organism:Homo sapiens (Human)
Description:P08588
Residue:477
BDBM50205509
NameBDBM50205509
Synonyms:(R,R)-(+)-ethyl {4-[2-{[2-(3-bromoisoxazol-5-yl)-2-hydroxyethyl]amino}propyl]phenoxy} acetate | CHEMBL226348
TypeSmall organic molecule
Emp. Form.C18H23BrN2O5
Mol. Mass.427.29
SMILESCCOC(=O)COc1ccc(C[C@@H](C)NC[C@@H](O)c2cc(Br)no2)cc1