Reaction Details
TargetBeta-1 adrenergic receptor
LigandBDBM50205508
Substrate/Competitorn/a
Meas. Tech.ChEMBL_435751 (CHEMBL920282)
Ki 6460±n/a nM
Citation Dallanoce, CFrigerio, FDe Amici, MDorsch, SKlotz, KNDe Micheli, C Novel chiral isoxazole derivatives: synthesis and pharmacological characterization at human beta-adrenergic receptor subtypes. Bioorg Med Chem15:2533-43 (2007) 
 
Beta-1 adrenergic receptor
Name:Beta-1 adrenergic receptor
Type:G Protein-Coupled Receptor (GPCR)
Mol. Mass.:51338.40
Organism:Homo sapiens (Human)
Description:P08588
Residue:477
BDBM50205508
NameBDBM50205508
Synonyms:(R,R)-(+)-{4-[2-{[2-(3-bromoisoxazol-5-yl)-2-hydroxyethyl]-amino}propyl]phenoxy}acetic acid | CHEMBL226293
TypeSmall organic molecule
Emp. Form.C16H19BrN2O5
Mol. Mass.399.236
SMILESC[C@H](Cc1ccc(OCC(O)=O)cc1)NC[C@@H](O)c1cc(Br)no1