Reaction Details
TargetBeta-3 adrenergic receptor
LigandBDBM50205507
Substrate/Competitorn/a
Meas. Tech.ChEMBL_435753 (CHEMBL920284)
Ki 22000±n/a nM
Citation Dallanoce, CFrigerio, FDe Amici, MDorsch, SKlotz, KNDe Micheli, C Novel chiral isoxazole derivatives: synthesis and pharmacological characterization at human beta-adrenergic receptor subtypes. Bioorg Med Chem15:2533-43 (2007) 
 
Beta-3 adrenergic receptor
Name:Beta-3 adrenergic receptor
Type:G Protein-Coupled Receptor (GPCR)
Mol. Mass.:43534.88
Organism:Homo sapiens (Human)
Description:n/a
Residue:408
BDBM50205507
NameBDBM50205507
Synonyms:(S,R)-(-)-{4-[2-{[2-(3-bromoisoxazol-5-yl)-2-hydroxyethyl]-amino}propyl]phenoxy}acetic acid | CHEMBL387851
TypeSmall organic molecule
Emp. Form.C16H19BrN2O5
Mol. Mass.399.236
SMILESC[C@H](Cc1ccc(OCC(O)=O)cc1)NC[C@H](O)c1cc(Br)no1