Reaction Details
TargetBeta-3 adrenergic receptor
LigandBDBM50205506
Substrate/Competitorn/a
Meas. Tech.ChEMBL_435753 (CHEMBL920284)
Ki 2485±n/a nM
Citation Dallanoce, CFrigerio, FDe Amici, MDorsch, SKlotz, KNDe Micheli, C Novel chiral isoxazole derivatives: synthesis and pharmacological characterization at human beta-adrenergic receptor subtypes. Bioorg Med Chem15:2533-43 (2007) 
 
Beta-3 adrenergic receptor
Name:Beta-3 adrenergic receptor
Type:G Protein-Coupled Receptor (GPCR)
Mol. Mass.:43534.88
Organism:Homo sapiens (Human)
Description:n/a
Residue:408
BDBM50205506
NameBDBM50205506
Synonyms:(S,R)-(-)-1-(3-bromoisoxazol-5-yl)-2-{[2-(4-butoxyphenyl)-1-methylethyl]amino}ethanol | CHEMBL226349
TypeSmall organic molecule
Emp. Form.C18H25BrN2O3
Mol. Mass.397.307
SMILESCCCCOc1ccc(C[C@@H](C)NC[C@H](O)c2cc(Br)no2)cc1