Reaction Details
TargetCytochrome P450 2D6
LigandBDBM50205679
Substrate/Competitorn/a
Meas. Tech.ChEMBL_438438 (CHEMBL887539)
IC50 3200±n/a nM
Citation Chu, GHGu, MCassel, JABelanger, SGraczyk, TMDeHaven, RNConway-James, NKoblish, MLittle, PJDeHaven-Hudkins, DLDolle, RE Novel malonamide derivatives as potent kappa opioid receptor agonists. Bioorg Med Chem Lett17:1951-5 (2007) 
 
Cytochrome P450 2D6
Name:Cytochrome P450 2D6
Type:Protein
Mol. Mass.:55774.82
Organism:Homo sapiens (Human)
Description:P10635
Residue:497
BDBM50205679
NameBDBM50205679
Synonyms:CHEMBL395288 | N1-benzyl-N3-((S)-2-((S)-3-hydroxypyrrolidin-1-yl)-1-phenylethyl)-N3-methylmalonamide
TypeSmall organic molecule
Emp. Form.C23H29N3O3
Mol. Mass.395.4947
SMILESCN([C@H](CN1CC[C@H](O)C1)c1ccccc1)C(=O)CC(=O)NCc1ccccc1