Reaction Details
TargetCytochrome P450 2D6
LigandBDBM50205678
Substrate/Competitorn/a
Meas. Tech.ChEMBL_438438 (CHEMBL887539)
IC50 3400±n/a nM
Citation Chu, GHGu, MCassel, JABelanger, SGraczyk, TMDeHaven, RNConway-James, NKoblish, MLittle, PJDeHaven-Hudkins, DLDolle, RE Novel malonamide derivatives as potent kappa opioid receptor agonists. Bioorg Med Chem Lett17:1951-5 (2007) 
 
Cytochrome P450 2D6
Name:Cytochrome P450 2D6
Type:Protein
Mol. Mass.:55774.82
Organism:Homo sapiens (Human)
Description:P10635
Residue:497
BDBM50205678
NameBDBM50205678
Synonyms:CHEMBL397475 | N1-((S)-2-((S)-3-hydroxypyrrolidin-1-yl)-1-phenylethyl)-N1-methyl-N4-(thiazol-2-yl)succinamide
TypeSmall organic molecule
Emp. Form.C20H26N4O3S
Mol. Mass.402.51
SMILESCN([C@H](CN1CC[C@H](O)C1)c1ccccc1)C(=O)CCC(=O)Nc1nccs1