Reaction Details
TargetCytochrome P450 2D6
LigandBDBM50205680
Substrate/Competitorn/a
Meas. Tech.ChEMBL_438438 (CHEMBL887539)
IC50>10000±n/a nM
Citation Chu, GHGu, MCassel, JABelanger, SGraczyk, TMDeHaven, RNConway-James, NKoblish, MLittle, PJDeHaven-Hudkins, DLDolle, RE Novel malonamide derivatives as potent kappa opioid receptor agonists. Bioorg Med Chem Lett17:1951-5 (2007) 
 
Cytochrome P450 2D6
Name:Cytochrome P450 2D6
Type:Protein
Mol. Mass.:55774.82
Organism:Homo sapiens (Human)
Description:P10635
Residue:497
BDBM50205680
NameBDBM50205680
Synonyms:CHEMBL230711 | N1-((S)-2-((S)-3-hydroxypyrrolidin-1-yl)-1-phenylethyl)-N1-methyl-N4-(pyridin-3-yl)succinamide
TypeSmall organic molecule
Emp. Form.C22H28N4O3
Mol. Mass.396.4827
SMILESCN([C@H](CN1CC[C@H](O)C1)c1ccccc1)C(=O)CCC(=O)Nc1cccnc1