Reaction Details
TargetC-C chemokine receptor type 5
LigandBDBM50205732
Substrate/Competitorn/a
Meas. Tech.ChEMBL_428416 (CHEMBL919486)
EC50 1900±n/a nM
Citation Kellenberger, ESpringael, JYParmentier, MHachet-Haas, MGalzi, JLRognan, D Identification of nonpeptide CCR5 receptor agonists by structure-based virtual screening. J Med Chem50:1294-303 (2007) 
 
C-C chemokine receptor type 5
Name:C-C chemokine receptor type 5
Type:Enzyme
Mol. Mass.:40540.21
Organism:Homo sapiens (Human)
Description:P51681
Residue:352
BDBM50205732
NameBDBM50205732
Synonyms:1-(3-diethylamino-propylamino)-3-methyl-2-(2-methyl-allyl)-benzo[4,5]imidazo[1,2-a]pyridine-4-carbonitrile | CHEMBL223686
TypeSmall organic molecule
Emp. Form.C24H31N5
Mol. Mass.389.5364
SMILESCCN(CC)CCCNc1c(CC(C)=C)c(C)c(C#N)c2nc3ccccc3n12