Reaction Details
TargetC-C chemokine receptor type 5
LigandBDBM50205733
Substrate/Competitorn/a
Meas. Tech.ChEMBL_428417 (CHEMBL919487)
IC50 269200±n/a nM
Citation Kellenberger, ESpringael, JYParmentier, MHachet-Haas, MGalzi, JLRognan, D Identification of nonpeptide CCR5 receptor agonists by structure-based virtual screening. J Med Chem50:1294-303 (2007) 
 
C-C chemokine receptor type 5
Name:C-C chemokine receptor type 5
Type:Enzyme
Mol. Mass.:40540.21
Organism:Homo sapiens (Human)
Description:P51681
Residue:352
BDBM50205733
NameBDBM50205733
Synonyms:CHEMBL219769 | N-(1-benzylpiperidin-4-yl)-2-(5-methyl-4-p-tolyl-4H-1,2,4-triazol-3-ylthio)acetamide
TypeSmall organic molecule
Emp. Form.C24H29N5OS
Mol. Mass.435.585
SMILESCc1nnc(SCC(=O)NC2CCN(Cc3ccccc3)CC2)n1-c1ccc(C)cc1