Reaction Details
TargetC-C chemokine receptor type 5
LigandBDBM50205737
Substrate/Competitorn/a
Meas. Tech.ChEMBL_428416 (CHEMBL919486)
EC50>100000±n/a nM
Citation Kellenberger, ESpringael, JYParmentier, MHachet-Haas, MGalzi, JLRognan, D Identification of nonpeptide CCR5 receptor agonists by structure-based virtual screening. J Med Chem50:1294-303 (2007) 
 
C-C chemokine receptor type 5
Name:C-C chemokine receptor type 5
Type:Enzyme
Mol. Mass.:40540.21
Organism:Homo sapiens (Human)
Description:P51681
Residue:352
BDBM50205737
NameBDBM50205737
Synonyms:1-((1-(4-fluorobenzyl)-1H-tetrazol-5-yl)(2-fluorophenyl)methyl)-4-cyclohexylpiperazine | CHEMBL375591
TypeSmall organic molecule
Emp. Form.C25H30F2N6
Mol. Mass.452.5427
SMILESFc1ccc(Cn2nnnc2C(N2CCN(CC2)C2CCCCC2)c2ccccc2F)cc1