Reaction Details
TargetAromatase
LigandBDBM50056999
Substrate/Competitorn/a
Meas. Tech.ChEMBL_428436 (CHEMBL919505)
IC50 27000±n/a nM
Citation Su, BLandini, SDavis, DDBrueggemeier, RW Synthesis and biological evaluation of selective aromatase expression regulators in breast cancer cells. J Med Chem50:1635-44 (2007) 
 
Aromatase
Name:Aromatase
Type:Enzyme
Mol. Mass.:57888.92
Organism:Homo sapiens (Human)
Description:P11511
Residue:503
BDBM50056999
NameBDBM50056999
Synonyms:CHEMBL56367 | nimesulide
TypeSmall organic molecule
Emp. Form.C13H12N2O5S
Mol. Mass.308.31
SMILESCS(=O)(=O)Nc1ccc(cc1Oc1ccccc1)[N+]([O-])=O